RDF description of c_1438959032248
primary topic: chemistry

chemistry
type: Concept
has status: Published
created: 2015-08-07T14:50:38Z
modified: 2017-03-21T13:43:19Z
broader: c_1401956207670
definition: The scientific study of the properties, composition, and structure of matter, the changes in structure and composition of matter, and accompanying energy changes. (Source: MGH)
definition: def 5f27248d
in scheme: anaeeThes
narrower: c_1438959137584
narrower: c_1438958922643
narrower: c_1438959096008
preferred label: chimie @fr