atmospheric chemistry
type: Concept
has status: Published
created: 2015-08-07T14:52:24Z
modified: 2017-03-08T09:20:24Z
broader: c_1438959032248
definition: The study of the production, transport, modification, and removal of atmospheric constituents in the troposphere and stratosphere.
definition: i def c 1438959137584
in scheme: anaeeThes
preferred label: chimie atmosphérique @fr

RDF description of c_1438959137584
primary topic: atmospheric chemistry