RDF description of c_209a90ec
primary topic: nutrient biogeochemical cycle

nutrient biogeochemical cycle
type: Concept
has status: Published
created: 2016-01-06T08:14:55Z
modified: 2017-03-09T17:26:55Z
broader: c2 2864
definition: A biogeochemical cycle, in which inorganic nutrients move through the soil, living organisms, air and water or through some of these.
definition: i def c 209a90ec
in scheme: anaeeThes
preferred label: cycle biogéochimique des nutriments @fr