RDF description of c_2a2eb2d6
primary topic: environmental information network

environmental information network
type: Concept
has status: Published
created: 2016-01-04T15:36:26Z
modified: 2017-03-21T14:18:54Z
broader: c_1401958363004
definition: i def c 2a2eb2d6
definition: A system of interrelated persons and devices linked to permit the exchange of data or knowledge concerning natural resources, human health and other ecological matters.
in scheme: anaeeThes
preferred label: réseau d'information environnementale @fr