sunshine duration
type: Concept
has status: Published
created: 2016-12-09T11:50:00Z
modified: 2017-03-22T15:40:35Z
broader: c4 4222
definition: Period of the day during which the sun is shining.
definition: i def c 2bf7d88e
in scheme: anaeeThes
preferred label: durée d'ensoleillement @fr

RDF description of c_2bf7d88e
primary topic: sunshine duration