RDF description of c_46992aa0
primary topic: greenhouse gas

greenhouse gas
type: Concept
has status: Published
created: 2015-11-18T15:35:54Z
modified: 2017-03-21T13:42:48Z
alternative label: greenhouse gases
broader: c2 2446
definition: i def c 46992aa0
definition: A collective expression for those components of the atmosphere that influence the greenhouse effect, namely carbon dioxide, methane, nitrous oxides, ozone, CFCs and water vapour.
in scheme: anaeeThes
preferred label: gaz à effet de serre @fr