ecosystem service
type: Concept
has status: Published
created: 2016-01-04T15:27:58Z
modified: 2017-03-21T13:43:18Z
alternative label: services écosystémiques @fr
alternative label: ecosystem services
broader: c_1402038921919
definition: def 8e937160
definition: The direct and indirect contributions of ecosystems to human well-being
in scheme: anaeeThes
preferred label: service écosystémique @fr

RDF description of c_4f874438
primary topic: ecosystem service