tundra
type: Concept
has status: Published
created: 2017-07-31T06:30:39Z
modified: 2017-07-31T12:58:38Z
broader: c_1401956910410
definition: An area supporting some vegetation (lichens, mosses, sedges and low shrubs) between the northern upper limit of trees and the lower limit of perennial snow on mountains, and on the fringes of the Antarctic continent and its neighbouring islands.
definition: i def c 5c260e5a
in scheme: anaeeThes
preferred label: toundra @fr

RDF description of c_5c260e5a
primary topic: tundra