environmental data
type: Concept
has status: Published
created: 2016-01-04T18:17:39Z
modified: 2017-03-21T14:18:59Z
broader: c d0431f56
definition: Information concerning the state or condition of the environment. (Source: RRDA)
definition: def 449fb01d
in scheme: anaeeThes
preferred label: donnée environnementale @fr

RDF description of c_6d94f23a
primary topic: environmental data