waste recycling
type: Concept
has status: Published
created: 2016-01-04T14:18:41Z
modified: 2017-03-13T08:14:21Z
broader: c ad30a6aa
definition: i def c 79be456f
definition: A method of recovering wastes as resources which includes the collection, and often involving the treatment, of waste products for use as a replacement of all or part of the raw material in a manufacturing process.
in scheme: anaeeThes
preferred label: recyclage des déchets @fr

RDF description of c_79be456f
primary topic: waste recycling