RDF description of c_a8b8de76
primary topic: mineralogy

mineralogy
type: Concept
has status: Published
created: 2018-07-03T09:36:23Z
modified: 2018-07-04T17:00:43Z
broader: c 9dd4ed6d
definition: The science which concerns the study of natural inorganic substances called minerals.
definition: i def c a8b8de76
in scheme: anaeeThes
preferred label: minéralogie @fr