RDF description of c_c6a3b627
primary topic: erosion

erosion
type: Concept
has status: Published
created: 2016-01-04T14:23:05Z
modified: 2017-03-13T08:25:03Z
broader: c2 113
definition: i def c c6a3b627
definition: The general process or the group of processes whereby the materials of Earth's crust are loosened , dissolved, or worn away and simultaneously moved from one place to another, by natural agencies, which include weathering, solution, corrosion, and transportation, but usually exclude mass wasting.
in scheme: anaeeThes
preferred label: érosion @fr