dendrometry
type: Concept
has status: Published
created: 2017-06-22T09:30:17Z
modified: 2017-08-09T13:46:37Z
broader: c2 153
definition: i def c dd55a935
definition: The measuring of the diameter of standing trees from the ground with a dendrometer that can also be used to measure tree heights.
in scheme: anaeeThes
preferred label: dendrométrie @fr

RDF description of c_dd55a935
primary topic: dendrometry