meteorology
type: Concept
has status: Published
created: 2017-08-19T16:09:05Z
modified: 2017-08-21T10:48:45Z
broader: c_1401956207670
definition: The science concerned with the atmosphere and its phenomena.
definition: i def c f4fbf965
in scheme: anaeeThes
narrower: c_1438939824163
preferred label: météorologie @fr

RDF description of c_f4fbf965
primary topic: meteorology