RDF description of c_f672fdae
primary topic: solid

solid
type: Concept
has status: Published
created: 2017-01-30T09:43:57Z
modified: 2017-03-21T14:19:02Z
broader: c2 117
definition: Is the three-dimensional figures used in solid geometry such as tetrahedron, cube, paralleliped, prisms, pyramids, cones, cylinders, sphere
definition: xDef e3f43250
in scheme: anaeeThes
preferred label: solide @fr